{"text_format":"3","workbook":"xlsx","n_sheets":3,"sheets":["Data Entry","Sales Report","Sales Forecast"],"not_rendered":{"charts":5,"defined_names":7,"pivot_tables":1},"read":"whole","date_system":"1900"}

{"sheet":"Data Entry","index":0,"n_rows":24,"n_cols":17,"rows_kept":24}
[{"$nulls":9},{"$f":"365*2","v":730}]
[null,"MONTHLY DATA ENTRY"]
[{"$nulls":11},"TOTALS",null,null,"FORECAST"]
[]
[null,"DATE","COMPANY","AMOUNT","PLANNED","COST","REVENUE","MONTH","QUARTER","YEAR","MONTH NUM (HIDE)","MONTH ","QUARTER ","YEARLY ","MONTH  ","QUARTER  ","YEAR  "]
[null,{"$f":"40657+(365*2)","v":"2013-04-23"},"A. Datum Corporation",{"v":6400,"d":"$6,400.00"},{"v":6200,"d":"$6,200.00"},{"v":4450,"d":"$4,450.00"},{"$f":"tblData[[#This Row],[AMOUNT]]-tblData[[#This Row],[COST]]","v":{"v":1950,"d":"$1,950.00"}},{"$f":"DATE(YEAR('Data Entry'!$B6),MONTH('Data Entry'!$B6),1)","v":"2013-04-01"},{"$f":"LOOKUP(MONTH('Data Entry'!$H6),{1,1;2,1;3,1;4,2;5,2;6,2;7,3;8,3;9,3;10,4;11,4;12,4})","v":{"v":2,"d":"Quarter 2"}},{"$f":"YEAR('Data Entry'!$B6)","v":2013},{"$f":"MONTH(tblData[[#This Row],[DATE]])","v":4},{"$f":"SUMIFS(tblData[AMOUNT],tblData[DATE],\">=\"&EOMONTH(tblData[[#This Row],[DATE]],-1)+1,tblData[DATE],\"<=\"&EOMONTH(tblData[[#This Row],[DATE]],0))","v":{"v":14600,"d":"$14,600.00"}},{"$f":"SUMIFS(tblData[AMOUNT],tblData[DATE],\">=\"&DATE(YEAR(tblData[[#This Row],[DATE]]),1,1),tblData[DATE],\"<=\"&DATE(YEAR(tblData[[#This Row],[DATE]]),12,31),tblData[QUARTER],tblData[[#This Row],[QUARTER]])","v":{"v":50800,"d":"$50,800.00"}},{"$f":"SUMIFS(tblData[AMOUNT],tblData[DATE],\">=\"&DATE(YEAR(tblData[[#This Row],[DATE]]),1,1),tblData[DATE],\"<=\"&DATE(YEAR(tblData[[#This Row],[DATE]]),12,31))","v":{"v":143800,"d":"$143,800.00"}},{"$f":"IFERROR(TREND($L$6:INDEX($L:$L,ROW(),1),$K$6:INDEX($K:$K,ROW(),1),IF(MONTH(tblData[[#This Row],[DATE]])=12,13,MONTH(tblData[[#This Row],[DATE]])+1)),\"\")","v":{"v":14600,"d":"$14,600.00"}},{"$f":"IFERROR(TREND($M$6:INDEX($M:$M,ROW(),1),$I$6:INDEX($I:$I,ROW(),1),IF(tblData[[#This Row],[QUARTER]]=4,5,tblData[[#This Row],[QUARTER]]+1)),\"\")","v":{"v":50800,"d":"$50,800.00"}},{"$f":"IFERROR(TREND($N$6:INDEX($N:$N,ROW(),1),$J$6:INDEX($J:$J,ROW(),1),tblData[[#This Row],[YEAR]]+1),\"\")","v":{"v":143800,"d":"$143,800.00"}}]
[null,{"$f":"40659+(365*2)","v":"2013-04-25"},"Contoso Pharmaceuticals",{"v":8200,"d":"$8,200.00"},{"v":8000,"d":"$8,000.00"},{"v":6400,"d":"$6,400.00"},{"$f":"tblData[[#This Row],[AMOUNT]]-tblData[[#This Row],[COST]]","v":{"v":1800,"d":"$1,800.00"}},{"$f":"DATE(YEAR('Data Entry'!$B7),MONTH('Data Entry'!$B7),1)","v":"2013-04-01"},{"$f":"LOOKUP(MONTH('Data Entry'!$H7),{1,1;2,1;3,1;4,2;5,2;6,2;7,3;8,3;9,3;10,4;11,4;12,4})","v":{"v":2,"d":"Quarter 2"}},{"$f":"YEAR('Data Entry'!$B7)","v":2013},{"$f":"MONTH(tblData[[#This Row],[DATE]])","v":4},{"$f":"SUMIFS(tblData[AMOUNT],tblData[DATE],\">=\"&EOMONTH(tblData[[#This Row],[DATE]],-1)+1,tblData[DATE],\"<=\"&EOMONTH(tblData[[#This Row],[DATE]],0))","v":{"v":14600,"d":"$14,600.00"}},{"$f":"SUMIFS(tblData[AMOUNT],tblData[DATE],\">=\"&DATE(YEAR(tblData[[#This Row],[DATE]]),1,1),tblData[DATE],\"<=\"&DATE(YEAR(tblData[[#This Row],[DATE]]),12,31),tblData[QUARTER],tblData[[#This Row],[QUARTER]])","v":{"v":50800,"d":"$50,800.00"}},{"$f":"SUMIFS(tblData[AMOUNT],tblData[DATE],\">=\"&DATE(YEAR(tblData[[#This Row],[DATE]]),1,1),tblData[DATE],\"<=\"&DATE(YEAR(tblData[[#This Row],[DATE]]),12,31))","v":{"v":143800,"d":"$143,800.00"}},{"$f":"IFERROR(TREND($L$6:INDEX($L:$L,ROW(),1),$K$6:INDEX($K:$K,ROW(),1),IF(MONTH(tblData[[#This Row],[DATE]])=12,13,MONTH(tblData[[#This Row],[DATE]])+1)),\"\")","v":{"v":14600,"d":"$14,600.00"}},{"$f":"IFERROR(TREND($M$6:INDEX($M:$M,ROW(),1),$I$6:INDEX($I:$I,ROW(),1),IF(tblData[[#This Row],[QUARTER]]=4,5,tblData[[#This Row],[QUARTER]]+1)),\"\")","v":{"v":50800,"d":"$50,800.00"}},{"$f":"IFERROR(TREND($N$6:INDEX($N:$N,ROW(),1),$J$6:INDEX($J:$J,ROW(),1),tblData[[#This Row],[YEAR]]+1),\"\")","v":{"v":143800,"d":"$143,800.00"}}]
[null,{"$f":"40671+(365*2)","v":"2013-05-07"},"Consolidated Messenger",{"v":4400,"d":"$4,400.00"},{"v":4200,"d":"$4,200.00"},{"v":2600,"d":"$2,600.00"},{"$f":"tblData[[#This Row],[AMOUNT]]-tblData[[#This Row],[COST]]","v":{"v":1800,"d":"$1,800.00"}},{"$f":"DATE(YEAR('Data Entry'!$B8),MONTH('Data Entry'!$B8),1)","v":"2013-05-01"},{"$f":"LOOKUP(MONTH('Data Entry'!$H8),{1,1;2,1;3,1;4,2;5,2;6,2;7,3;8,3;9,3;10,4;11,4;12,4})","v":{"v":2,"d":"Quarter 2"}},{"$f":"YEAR('Data Entry'!$B8)","v":2013},{"$f":"MONTH(tblData[[#This Row],[DATE]])","v":5},{"$f":"SUMIFS(tblData[AMOUNT],tblData[DATE],\">=\"&EOMONTH(tblData[[#This Row],[DATE]],-1)+1,tblData[DATE],\"<=\"&EOMONTH(tblData[[#This Row],[DATE]],0))","v":{"v":21800,"d":"$21,800.00"}},{"$f":"SUMIFS(tblData[AMOUNT],tblData[DATE],\">=\"&DATE(YEAR(tblData[[#This Row],[DATE]]),1,1),tblData[DATE],\"<=\"&DATE(YEAR(tblData[[#This Row],[DATE]]),12,31),tblData[QUARTER],tblData[[#This Row],[QUARTER]])","v":{"v":50800,"d":"$50,800.00"}},{"$f":"SUMIFS(tblData[AMOUNT],tblData[DATE],\">=\"&DATE(YEAR(tblData[[#This Row],[DATE]]),1,1),tblData[DATE],\"<=\"&DATE(YEAR(tblData[[#This Row],[DATE]]),12,31))","v":{"v":143800,"d":"$143,800.00"}},{"$f":"IFERROR(TREND($L$6:INDEX($L:$L,ROW(),1),$K$6:INDEX($K:$K,ROW(),1),IF(MONTH(tblData[[#This Row],[DATE]])=12,13,MONTH(tblData[[#This Row],[DATE]])+1)),\"\")","v":{"v":28999.999999999996,"d":"$29,000.00"}},{"$f":"IFERROR(TREND($M$6:INDEX($M:$M,ROW(),1),$I$6:INDEX($I:$I,ROW(),1),IF(tblData[[#This Row],[QUARTER]]=4,5,tblData[[#This Row],[QUARTER]]+1)),\"\")","v":{"v":50800,"d":"$50,800.00"}},{"$f":"IFERROR(TREND($N$6:INDEX($N:$N,ROW(),1),$J$6:INDEX($J:$J,ROW(),1),tblData[[#This Row],[YEAR]]+1),\"\")","v":{"v":143800,"d":"$143,800.00"}}]
[null,{"$f":"40678+(365*2)","v":"2013-05-14"},"Proseware, Inc.",{"v":5400,"d":"$5,400.00"},{"v":5500,"d":"$5,500.00"},{"v":4500,"d":"$4,500.00"},{"$f":"tblData[[#This Row],[AMOUNT]]-tblData[[#This Row],[COST]]","v":{"v":900,"d":"$900.00"}},{"$f":"DATE(YEAR('Data Entry'!$B9),MONTH('Data Entry'!$B9),1)","v":"2013-05-01"},{"$f":"LOOKUP(MONTH('Data Entry'!$H9),{1,1;2,1;3,1;4,2;5,2;6,2;7,3;8,3;9,3;10,4;11,4;12,4})","v":{"v":2,"d":"Quarter 2"}},{"$f":"YEAR('Data Entry'!$B9)","v":2013},{"$f":"MONTH(tblData[[#This Row],[DATE]])","v":5},{"$f":"SUMIFS(tblData[AMOUNT],tblData[DATE],\">=\"&EOMONTH(tblData[[#This Row],[DATE]],-1)+1,tblData[DATE],\"<=\"&EOMONTH(tblData[[#This Row],[DATE]],0))","v":{"v":21800,"d":"$21,800.00"}},{"$f":"SUMIFS(tblData[AMOUNT],tblData[DATE],\">=\"&DATE(YEAR(tblData[[#This Row],[DATE]]),1,1),tblData[DATE],\"<=\"&DATE(YEAR(tblData[[#This Row],[DATE]]),12,31),tblData[QUARTER],tblData[[#This Row],[QUARTER]])","v":{"v":50800,"d":"$50,800.00"}},{"$f":"SUMIFS(tblData[AMOUNT],tblData[DATE],\">=\"&DATE(YEAR(tblData[[#This Row],[DATE]]),1,1),tblData[DATE],\"<=\"&DATE(YEAR(tblData[[#This Row],[DATE]]),12,31))","v":{"v":143800,"d":"$143,800.00"}},{"$f":"IFERROR(TREND($L$6:INDEX($L:$L,ROW(),1),$K$6:INDEX($K:$K,ROW(),1),IF(MONTH(tblData[[#This Row],[DATE]])=12,13,MONTH(tblData[[#This Row],[DATE]])+1)),\"\")","v":{"v":29000,"d":"$29,000.00"}},{"$f":"IFERROR(TREND($M$6:INDEX($M:$M,ROW(),1),$I$6:INDEX($I:$I,ROW(),1),IF(tblData[[#This Row],[QUARTER]]=4,5,tblData[[#This Row],[QUARTER]]+1)),\"\")","v":{"v":50800,"d":"$50,800.00"}},{"$f":"IFERROR(TREND($N$6:INDEX($N:$N,ROW(),1),$J$6:INDEX($J:$J,ROW(),1),tblData[[#This Row],[YEAR]]+1),\"\")","v":{"v":143800,"d":"$143,800.00"}}]
[null,{"$f":"40678+(365*2)","v":"2013-05-14"},"School of Fine Art",{"v":5800,"d":"$5,800.00"},{"v":6000,"d":"$6,000.00"},{"v":4500,"d":"$4,500.00"},{"$f":"tblData[[#This Row],[AMOUNT]]-tblData[[#This Row],[COST]]","v":{"v":1300,"d":"$1,300.00"}},{"$f":"DATE(YEAR('Data Entry'!$B10),MONTH('Data Entry'!$B10),1)","v":"2013-05-01"},{"$f":"LOOKUP(MONTH('Data Entry'!$H10),{1,1;2,1;3,1;4,2;5,2;6,2;7,3;8,3;9,3;10,4;11,4;12,4})","v":{"v":2,"d":"Quarter 2"}},{"$f":"YEAR('Data Entry'!$B10)","v":2013},{"$f":"MONTH(tblData[[#This Row],[DATE]])","v":5},{"$f":"SUMIFS(tblData[AMOUNT],tblData[DATE],\">=\"&EOMONTH(tblData[[#This Row],[DATE]],-1)+1,tblData[DATE],\"<=\"&EOMONTH(tblData[[#This Row],[DATE]],0))","v":{"v":21800,"d":"$21,800.00"}},{"$f":"SUMIFS(tblData[AMOUNT],tblData[DATE],\">=\"&DATE(YEAR(tblData[[#This Row],[DATE]]),1,1),tblData[DATE],\"<=\"&DATE(YEAR(tblData[[#This Row],[DATE]]),12,31),tblData[QUARTER],tblData[[#This Row],[QUARTER]])","v":{"v":50800,"d":"$50,800.00"}},{"$f":"SUMIFS(tblData[AMOUNT],tblData[DATE],\">=\"&DATE(YEAR(tblData[[#This Row],[DATE]]),1,1),tblData[DATE],\"<=\"&DATE(YEAR(tblData[[#This Row],[DATE]]),12,31))","v":{"v":143800,"d":"$143,800.00"}},{"$f":"IFERROR(TREND($L$6:INDEX($L:$L,ROW(),1),$K$6:INDEX($K:$K,ROW(),1),IF(MONTH(tblData[[#This Row],[DATE]])=12,13,MONTH(tblData[[#This Row],[DATE]])+1)),\"\")","v":{"v":29000,"d":"$29,000.00"}},{"$f":"IFERROR(TREND($M$6:INDEX($M:$M,ROW(),1),$I$6:INDEX($I:$I,ROW(),1),IF(tblData[[#This Row],[QUARTER]]=4,5,tblData[[#This Row],[QUARTER]]+1)),\"\")","v":{"v":50800,"d":"$50,800.00"}},{"$f":"IFERROR(TREND($N$6:INDEX($N:$N,ROW(),1),$J$6:INDEX($J:$J,ROW(),1),tblData[[#This Row],[YEAR]]+1),\"\")","v":{"v":143800,"d":"$143,800.00"}}]
[null,{"$f":"40693+(365*2)","v":"2013-05-29"},"Trey Research",{"v":6200,"d":"$6,200.00"},{"v":6000,"d":"$6,000.00"},{"v":4500,"d":"$4,500.00"},{"$f":"tblData[[#This Row],[AMOUNT]]-tblData[[#This Row],[COST]]","v":{"v":1700,"d":"$1,700.00"}},{"$f":"DATE(YEAR('Data Entry'!$B11),MONTH('Data Entry'!$B11),1)","v":"2013-05-01"},{"$f":"LOOKUP(MONTH('Data Entry'!$H11),{1,1;2,1;3,1;4,2;5,2;6,2;7,3;8,3;9,3;10,4;11,4;12,4})","v":{"v":2,"d":"Quarter 2"}},{"$f":"YEAR('Data Entry'!$B11)","v":2013},{"$f":"MONTH(tblData[[#This Row],[DATE]])","v":5},{"$f":"SUMIFS(tblData[AMOUNT],tblData[DATE],\">=\"&EOMONTH(tblData[[#This Row],[DATE]],-1)+1,tblData[DATE],\"<=\"&EOMONTH(tblData[[#This Row],[DATE]],0))","v":{"v":21800,"d":"$21,800.00"}},{"$f":"SUMIFS(tblData[AMOUNT],tblData[DATE],\">=\"&DATE(YEAR(tblData[[#This Row],[DATE]]),1,1),tblData[DATE],\"<=\"&DATE(YEAR(tblData[[#This Row],[DATE]]),12,31),tblData[QUARTER],tblData[[#This Row],[QUARTER]])","v":{"v":50800,"d":"$50,800.00"}},{"$f":"SUMIFS(tblData[AMOUNT],tblData[DATE],\">=\"&DATE(YEAR(tblData[[#This Row],[DATE]]),1,1),tblData[DATE],\"<=\"&DATE(YEAR(tblData[[#This Row],[DATE]]),12,31))","v":{"v":143800,"d":"$143,800.00"}},{"$f":"IFERROR(TREND($L$6:INDEX($L:$L,ROW(),1),$K$6:INDEX($K:$K,ROW(),1),IF(MONTH(tblData[[#This Row],[DATE]])=12,13,MONTH(tblData[[#This Row],[DATE]])+1)),\"\")","v":{"v":29000,"d":"$29,000.00"}},{"$f":"IFERROR(TREND($M$6:INDEX($M:$M,ROW(),1),$I$6:INDEX($I:$I,ROW(),1),IF(tblData[[#This Row],[QUARTER]]=4,5,tblData[[#This Row],[QUARTER]]+1)),\"\")","v":{"v":50800,"d":"$50,800.00"}},{"$f":"IFERROR(TREND($N$6:INDEX($N:$N,ROW(),1),$J$6:INDEX($J:$J,ROW(),1),tblData[[#This Row],[YEAR]]+1),\"\")","v":{"v":143800,"d":"$143,800.00"}}]
[null,{"$f":"40705+(365*2)","v":"2013-06-10"},"A. Datum Corporation",{"v":6900,"d":"$6,900.00"},{"v":7500,"d":"$7,500.00"},{"v":5400,"d":"$5,400.00"},{"$f":"tblData[[#This Row],[AMOUNT]]-tblData[[#This Row],[COST]]","v":{"v":1500,"d":"$1,500.00"}},{"$f":"DATE(YEAR('Data Entry'!$B12),MONTH('Data Entry'!$B12),1)","v":"2013-06-01"},{"$f":"LOOKUP(MONTH('Data Entry'!$H12),{1,1;2,1;3,1;4,2;5,2;6,2;7,3;8,3;9,3;10,4;11,4;12,4})","v":{"v":2,"d":"Quarter 2"}},{"$f":"YEAR('Data Entry'!$B12)","v":2013},{"$f":"MONTH(tblData[[#This Row],[DATE]])","v":6},{"$f":"SUMIFS(tblData[AMOUNT],tblData[DATE],\">=\"&EOMONTH(tblData[[#This Row],[DATE]],-1)+1,tblData[DATE],\"<=\"&EOMONTH(tblData[[#This Row],[DATE]],0))","v":{"v":14400,"d":"$14,400.00"}},{"$f":"SUMIFS(tblData[AMOUNT],tblData[DATE],\">=\"&DATE(YEAR(tblData[[#This Row],[DATE]]),1,1),tblData[DATE],\"<=\"&DATE(YEAR(tblData[[#This Row],[DATE]]),12,31),tblData[QUARTER],tblData[[#This Row],[QUARTER]])","v":{"v":50800,"d":"$50,800.00"}},{"$f":"SUMIFS(tblData[AMOUNT],tblData[DATE],\">=\"&DATE(YEAR(tblData[[#This Row],[DATE]]),1,1),tblData[DATE],\"<=\"&DATE(YEAR(tblData[[#This Row],[DATE]]),12,31))","v":{"v":143800,"d":"$143,800.00"}},{"$f":"IFERROR(TREND($L$6:INDEX($L:$L,ROW(),1),$K$6:INDEX($K:$K,ROW(),1),IF(MONTH(tblData[[#This Row],[DATE]])=12,13,MONTH(tblData[[#This Row],[DATE]])+1)),\"\")","v":{"v":21600.000000000004,"d":"$21,600.00"}},{"$f":"IFERROR(TREND($M$6:INDEX($M:$M,ROW(),1),$I$6:INDEX($I:$I,ROW(),1),IF(tblData[[#This Row],[QUARTER]]=4,5,tblData[[#This Row],[QUARTER]]+1)),\"\")","v":{"v":50800,"d":"$50,800.00"}},{"$f":"IFERROR(TREND($N$6:INDEX($N:$N,ROW(),1),$J$6:INDEX($J:$J,ROW(),1),tblData[[#This Row],[YEAR]]+1),\"\")","v":{"v":143800,"d":"$143,800.00"}}]
[null,{"$f":"40716+(365*2)","v":"2013-06-21"},"Contoso Pharmaceuticals",{"v":7500,"d":"$7,500.00"},{"v":7200,"d":"$7,200.00"},{"v":6500,"d":"$6,500.00"},{"$f":"tblData[[#This Row],[AMOUNT]]-tblData[[#This Row],[COST]]","v":{"v":1000,"d":"$1,000.00"}},{"$f":"DATE(YEAR('Data Entry'!$B13),MONTH('Data Entry'!$B13),1)","v":"2013-06-01"},{"$f":"LOOKUP(MONTH('Data Entry'!$H13),{1,1;2,1;3,1;4,2;5,2;6,2;7,3;8,3;9,3;10,4;11,4;12,4})","v":{"v":2,"d":"Quarter 2"}},{"$f":"YEAR('Data Entry'!$B13)","v":2013},{"$f":"MONTH(tblData[[#This Row],[DATE]])","v":6},{"$f":"SUMIFS(tblData[AMOUNT],tblData[DATE],\">=\"&EOMONTH(tblData[[#This Row],[DATE]],-1)+1,tblData[DATE],\"<=\"&EOMONTH(tblData[[#This Row],[DATE]],0))","v":{"v":14400,"d":"$14,400.00"}},{"$f":"SUMIFS(tblData[AMOUNT],tblData[DATE],\">=\"&DATE(YEAR(tblData[[#This Row],[DATE]]),1,1),tblData[DATE],\"<=\"&DATE(YEAR(tblData[[#This Row],[DATE]]),12,31),tblData[QUARTER],tblData[[#This Row],[QUARTER]])","v":{"v":50800,"d":"$50,800.00"}},{"$f":"SUMIFS(tblData[AMOUNT],tblData[DATE],\">=\"&DATE(YEAR(tblData[[#This Row],[DATE]]),1,1),tblData[DATE],\"<=\"&DATE(YEAR(tblData[[#This Row],[DATE]]),12,31))","v":{"v":143800,"d":"$143,800.00"}},{"$f":"IFERROR(TREND($L$6:INDEX($L:$L,ROW(),1),$K$6:INDEX($K:$K,ROW(),1),IF(MONTH(tblData[[#This Row],[DATE]])=12,13,MONTH(tblData[[#This Row],[DATE]])+1)),\"\")","v":{"v":17950,"d":"$17,950.00"}},{"$f":"IFERROR(TREND($M$6:INDEX($M:$M,ROW(),1),$I$6:INDEX($I:$I,ROW(),1),IF(tblData[[#This Row],[QUARTER]]=4,5,tblData[[#This Row],[QUARTER]]+1)),\"\")","v":{"v":50800,"d":"$50,800.00"}},{"$f":"IFERROR(TREND($N$6:INDEX($N:$N,ROW(),1),$J$6:INDEX($J:$J,ROW(),1),tblData[[#This Row],[YEAR]]+1),\"\")","v":{"v":143800,"d":"$143,800.00"}}]
[null,{"$f":"40731+(365*2)","v":"2013-07-06"},"Consolidated Messenger",{"v":8700,"d":"$8,700.00"},{"v":8500,"d":"$8,500.00"},{"v":7250,"d":"$7,250.00"},{"$f":"tblData[[#This Row],[AMOUNT]]-tblData[[#This Row],[COST]]","v":{"v":1450,"d":"$1,450.00"}},{"$f":"DATE(YEAR('Data Entry'!$B14),MONTH('Data Entry'!$B14),1)","v":"2013-07-01"},{"$f":"LOOKUP(MONTH('Data Entry'!$H14),{1,1;2,1;3,1;4,2;5,2;6,2;7,3;8,3;9,3;10,4;11,4;12,4})","v":{"v":3,"d":"Quarter 3"}},{"$f":"YEAR('Data Entry'!$B14)","v":2013},{"$f":"MONTH(tblData[[#This Row],[DATE]])","v":7},{"$f":"SUMIFS(tblData[AMOUNT],tblData[DATE],\">=\"&EOMONTH(tblData[[#This Row],[DATE]],-1)+1,tblData[DATE],\"<=\"&EOMONTH(tblData[[#This Row],[DATE]],0))","v":{"v":8700,"d":"$8,700.00"}},{"$f":"SUMIFS(tblData[AMOUNT],tblData[DATE],\">=\"&DATE(YEAR(tblData[[#This Row],[DATE]]),1,1),tblData[DATE],\"<=\"&DATE(YEAR(tblData[[#This Row],[DATE]]),12,31),tblData[QUARTER],tblData[[#This Row],[QUARTER]])","v":{"v":49100,"d":"$49,100.00"}},{"$f":"SUMIFS(tblData[AMOUNT],tblData[DATE],\">=\"&DATE(YEAR(tblData[[#This Row],[DATE]]),1,1),tblData[DATE],\"<=\"&DATE(YEAR(tblData[[#This Row],[DATE]]),12,31))","v":{"v":143800,"d":"$143,800.00"}},{"$f":"IFERROR(TREND($L$6:INDEX($L:$L,ROW(),1),$K$6:INDEX($K:$K,ROW(),1),IF(MONTH(tblData[[#This Row],[DATE]])=12,13,MONTH(tblData[[#This Row],[DATE]])+1)),\"\")","v":{"v":10776.470588235294,"d":"$10,776.47"}},{"$f":"IFERROR(TREND($M$6:INDEX($M:$M,ROW(),1),$I$6:INDEX($I:$I,ROW(),1),IF(tblData[[#This Row],[QUARTER]]=4,5,tblData[[#This Row],[QUARTER]]+1)),\"\")","v":{"v":47400,"d":"$47,400.00"}},{"$f":"IFERROR(TREND($N$6:INDEX($N:$N,ROW(),1),$J$6:INDEX($J:$J,ROW(),1),tblData[[#This Row],[YEAR]]+1),\"\")","v":{"v":143800,"d":"$143,800.00"}}]
[null,{"$f":"40761+(365*2)","v":"2013-08-05"},"Proseware, Inc.",{"v":8500,"d":"$8,500.00"},{"v":8300,"d":"$8,300.00"},{"v":7100,"d":"$7,100.00"},{"$f":"tblData[[#This Row],[AMOUNT]]-tblData[[#This Row],[COST]]","v":{"v":1400,"d":"$1,400.00"}},{"$f":"DATE(YEAR('Data Entry'!$B15),MONTH('Data Entry'!$B15),1)","v":"2013-08-01"},{"$f":"LOOKUP(MONTH('Data Entry'!$H15),{1,1;2,1;3,1;4,2;5,2;6,2;7,3;8,3;9,3;10,4;11,4;12,4})","v":{"v":3,"d":"Quarter 3"}},{"$f":"YEAR('Data Entry'!$B15)","v":2013},{"$f":"MONTH(tblData[[#This Row],[DATE]])","v":8},{"$f":"SUMIFS(tblData[AMOUNT],tblData[DATE],\">=\"&EOMONTH(tblData[[#This Row],[DATE]],-1)+1,tblData[DATE],\"<=\"&EOMONTH(tblData[[#This Row],[DATE]],0))","v":{"v":16400,"d":"$16,400.00"}},{"$f":"SUMIFS(tblData[AMOUNT],tblData[DATE],\">=\"&DATE(YEAR(tblData[[#This Row],[DATE]]),1,1),tblData[DATE],\"<=\"&DATE(YEAR(tblData[[#This Row],[DATE]]),12,31),tblData[QUARTER],tblData[[#This Row],[QUARTER]])","v":{"v":49100,"d":"$49,100.00"}},{"$f":"SUMIFS(tblData[AMOUNT],tblData[DATE],\">=\"&DATE(YEAR(tblData[[#This Row],[DATE]]),1,1),tblData[DATE],\"<=\"&DATE(YEAR(tblData[[#This Row],[DATE]]),12,31))","v":{"v":143800,"d":"$143,800.00"}},{"$f":"IFERROR(TREND($L$6:INDEX($L:$L,ROW(),1),$K$6:INDEX($K:$K,ROW(),1),IF(MONTH(tblData[[#This Row],[DATE]])=12,13,MONTH(tblData[[#This Row],[DATE]])+1)),\"\")","v":{"v":12455.862068965516,"d":"$12,455.86"}},{"$f":"IFERROR(TREND($M$6:INDEX($M:$M,ROW(),1),$I$6:INDEX($I:$I,ROW(),1),IF(tblData[[#This Row],[QUARTER]]=4,5,tblData[[#This Row],[QUARTER]]+1)),\"\")","v":{"v":47400,"d":"$47,400.00"}},{"$f":"IFERROR(TREND($N$6:INDEX($N:$N,ROW(),1),$J$6:INDEX($J:$J,ROW(),1),tblData[[#This Row],[YEAR]]+1),\"\")","v":{"v":143800,"d":"$143,800.00"}}]
{"$rows_left_out":10}
{"sheet":"Sales Report","index":1,"n_rows":28,"n_cols":6,"rows_kept":28}
[]
[null,"MONTHLY SALES REPORT"]
[]
[]
[null,"YEAR","QUARTER","MONTH","COMPANY","TOTAL SALES"]
[null,2013,{"v":2,"d":" Quarter 2"},"2013-04-01","A. Datum Corporation",{"v":6400,"d":"$6,400.00"}]
[{"$nulls":4},"Contoso Pharmaceuticals",{"v":8200,"d":"$8,200.00"}]
[{"$nulls":3},"2013-05-01","Consolidated Messenger",{"v":4400,"d":"$4,400.00"}]
[{"$nulls":4},"Proseware, Inc.",{"v":5400,"d":"$5,400.00"}]
[{"$nulls":4},"School of Fine Art",{"v":5800,"d":"$5,800.00"}]
[{"$nulls":4},"Trey Research",{"v":6200,"d":"$6,200.00"}]
[{"$nulls":3},"2013-06-01","A. Datum Corporation",{"v":6900,"d":"$6,900.00"}]
[{"$nulls":4},"Contoso Pharmaceuticals",{"v":7500,"d":"$7,500.00"}]
[null,null," Quarter 2 Total",null,null,{"v":50800,"d":"$50,800.00"}]
[null,null,{"v":3,"d":" Quarter 3"},"2013-07-01","Consolidated Messenger",{"v":8700,"d":"$8,700.00"}]
{"$rows_left_out":14}
{"sheet":"Sales Forecast","index":2,"n_rows":43,"n_cols":10,"rows_kept":43}
[]
[null,"MONTHLY SALES FORECAST"]
[null,{"$f":"\"TODAY'S DATE: \"&UPPER(TEXT(TODAY(),\"mmm d, yyyy\"))","v":"TODAY'S DATE: JUN 27, 2012"},null,{"$f":"--TRIM(RIGHT(B3,LEN(B3)-FIND(\":\",B3)))","v":"2012-06-27"}]
[]
[null,"THIS MONTH","ACTUAL","PLAN","VARIANCE","%","YTD ACTUAL","YTD PLAN","YTD VARIANCE","YTD %"]
[null,"Quantity",{"$f":"COUNTIF('Data Entry'!$B$6:$B$24,\">=\"&DATE(fYear,MONTH(fDate),1))-COUNTIF('Data Entry'!$B$6:$B$24,\">\"&EOMONTH(fDate,0))","v":0},{"$nulls":3},{"$f":"COUNTIF(tblData[DATE],\"<=\"&EOMONTH(fDate,0))","v":0}]
[null,"Sales",{"$f":"SUMIF(tblData[DATE],\">=\"&DATE(fYear,MONTH(fDate),1),tblData[AMOUNT])-SUMIF(tblData[DATE],\">\"&EOMONTH(fDate,0),tblData[AMOUNT])","v":{"v":0,"d":"$0.00"}},{"$f":"SUMIF('Data Entry'!$B$6:$B$24,\">=\"&DATE(fYear,MONTH(fDate),1),'Data Entry'!$E$6:$E$24)-SUMIF('Data Entry'!$B$6:$B$24,\">\"&EOMONTH(fDate,0),'Data Entry'!$E$6:$E$24)","v":{"v":0,"d":"$0.00"}},{"$f":"D7-C7","v":{"v":0,"d":"$0.00"}},{"$f":"IFERROR(D7/C7,\"-\")","v":"-"},{"$f":"SUMIF(tblData[DATE],\"<=\"&EOMONTH(fDate,0),tblData[AMOUNT])","v":{"v":0,"d":"$0.00"}},{"$f":"SUMIF(tblData[DATE],\"<=\"&EOMONTH(fDate,0),tblData[PLANNED])","v":{"v":0,"d":"$0.00"}},{"$f":"H7-G7","v":{"v":0,"d":"$0.00"}},{"$f":"IFERROR(H7/G7,\"\")","v":""}]
[null,"Revenues",{"$f":"(SUMIF(tblData[DATE],\">=\"&DATE(fYear,MONTH(fDate),1),tblData[AMOUNT])-SUMIF(tblData[DATE],\">\"&EOMONTH(fDate,0),tblData[AMOUNT]))-(SUMIF(tblData[DATE],\">=\"&DATE(fYear,MONTH(fDate),1),tblData[COST])-SUMIF(tblData[DATE],\">\"&EOMONTH(fDate,0),tblData[COST]))","v":{"v":0,"d":"$0.00"}},{"$f":"(SUMIF('Data Entry'!$B$6:$B$24,\">=\"&DATE(fYear,MONTH(fDate),1),'Data Entry'!$E$6:$E$24)-SUMIF('Data Entry'!$B$6:$B$24,\">\"&EOMONTH(fDate,0),'Data Entry'!$E$6:$E$24))-(SUMIF('Data Entry'!$B$6:$B$24,\">=\"&DATE(fYear,MONTH(fDate),1),'Data Entry'!$F$6:$F$24)-SUMIF('Data Entry'!$B$6:$B$24,\">\"&EOMONTH(fDate,0),'Data Entry'!$F$6:$F$24))","v":{"v":0,"d":"$0.00"}},{"$f":"D8-C8","v":{"v":0,"d":"$0.00"}},{"$f":"IFERROR(D8/C8,\"-\")","v":"-"},{"$f":"SUMIF('Data Entry'!$B$6:$B$24,\"<=\"&EOMONTH(fDate,0),'Data Entry'!$F$6:$F$24)","v":{"v":0,"d":"$0.00"}},{"$f":"SUMIF(tblData[DATE],\"<=\"&EOMONTH(fDate,0),tblData[COST])","v":{"v":0,"d":"$0.00"}},{"$f":"H8-G8","v":{"v":0,"d":"$0.00"}},{"$f":"IFERROR(H8/G8,\"\")","v":""}]
[null,"Margin",{"$f":"IFERROR(C8/C7,\"-\")","v":"-"},{"$f":"IFERROR(D8/D7,\"-\")","v":"-"},null,{"$f":"IFERROR(F8/F7,\"-\")","v":"-"},{"$f":"IFERROR(G8/G7,\"\")","v":""},{"$f":"IFERROR(H8/H7,\"\")","v":""},null,{"$f":"IFERROR(J8/J7,\"\")","v":""}]
[null,"Number of Orders",{"$f":"COUNTIF(tblData[DATE],\">=\"&DATE(fYear,MONTH(fDate),1))-COUNTIF(tblData[DATE],\">\"&EOMONTH(fDate,0))","v":0},{"$nulls":3},{"$f":"COUNTIF(tblData[DATE],\">\"&EOMONTH(fDate,0))","v":19}]
[null,"Average Order Value",{"$f":"IFERROR(C7/C10,\"-\")","v":"-"},{"$nulls":3},{"$f":"IFERROR(G7/G10,\"-\")","v":{"v":0,"d":"$0.00"}}]
[]
[null,"FORECAST",null,"NEXT MONTH",null,"NEXT QUARTER",null,null,"NEXT YEAR"]
[null,"Sales",null,{"$f":"TREND(tblData[[MONTH ]],tblData[MONTH NUM (HIDE)],IF(MONTH(fDate)=12,13,MONTH(fDate)+1))","v":{"v":18399.4923857868,"d":"$18,399.49"}},null,{"$f":"TREND(tblData[[QUARTER ]],tblData[MONTH NUM (HIDE)],IF(MONTH(fDate)=12,13,MONTH(fDate)+1))","v":{"v":49073.60406091371,"d":"$49,073.60"}},null,null,{"$f":"TREND(tblData[[YEARLY ]],tblData[MONTH NUM (HIDE)],IF(MONTH(fDate)=12,13,MONTH(fDate)+1))","v":{"v":143800,"d":"$143,800.00"}}]
[]
{"$rows_left_out":10}